Target
Gag-Pol polyprotein [588-1127,L687I]/[588-1147,L687I]
Ligand
BDBM2136
Substrate
(rC)n.(dG)12-18
Meas. Tech.
HIV-1 RT Assay
IC50
1650±n/a nM
Citation
 Cantrell, ASEngelhardt, PHogberg, MJaskunas, SRJohansson, NGJordan, CLKangasmetsa, JKinnick, MDLind, PMorin, JMMuesing, MANoreen, ROberg, BPranc, PSahlberg, CTernansky, RJVasileff, RTVrang, LWest, SJZhang, H Phenethylthiazolylthiourea (PETT) compounds as a new class of HIV-1 reverse transcriptase inhibitors. 2. Synthesis and further structure-activity relationship studies of PETT analogs. J Med Chem 39:4261-74 (1996)  
Target
Name:
Gag-Pol polyprotein [588-1127,L687I]/[588-1147,L687I]
Synonyms:
EC: 2.7.7.49 | HIV-1 Reverse Transcriptase Mutant (L100I)
Type:
Protein Complex
Mol. Mass.:
Description:
Components:
This complex has 2 components.
Component 1
Name:
Gag-Pol polyprotein [588-1147,L687I]
Synonyms:
HIV-1 Reverse Transcriptase Mutant (L100I) Chain A gag-pol
Type:
Enzyme Subunit
Mol. Mass.:
64486.41
Organism:
Human immunodeficiency virus type 1
Description:
P04585[588-1147,L687I]
Residue:
560
  
Component 2
Name:
Gag-Pol polyprotein [588-1127,L687I]
Synonyms:
HIV-1 Reverse Transcriptase Mutant (L100I) Chain B gag-pol
Type:
Enzyme Subunit
Mol. Mass.:
51337.13
Organism:
Human immunodeficiency virus type 1
Description:
P04585[588-1127,L687I]
Residue:
440
  
Inhibitor
Name:
BDBM2136
Synonyms:
1-(5-bromopyridin-2-yl)-3-[2-(2,5-diethoxyphenyl)ethyl]thiourea N-[2-(2,5-Diethoxyphenethyl)]-N-[2-(5-bromopyridyl)]-thiourea | PETT deriv.
Type:
Small organic molecule
Emp. Form.:
C18H22BrN3O2S
Mol. Mass.:
424.355
SMILES:
CCOc1ccc(OCC)c(CCNC(=S)Nc2ccc(Br)cn2)c1
:
Substrate
Name:
(rC)n.(dG)12-18
Synonyms:
Type:
RNA-DNA duplex
Mol. Mass.:
358.43
Organism:
Description:
The incorporation of Tritium-labeled dGTP onto a poly(rC):oligo(dG)template:primer.
Residue:
3
NA