Target
Ras-related protein Rab-7a
Ligand
BDBM54615
Substrate
Meas. Tech.
Pyrazoline SAR compounds tested via Multiplex dose response to identify specific small molecule inhibitors of Ras and Ras-related GTPases specifically Rab7 wildtype
EC50
30000±n/a nM
Citation
 PubChem, PC Pyrazoline SAR compounds tested via Multiplex dose response to identify specific small molecule inhibitors of Ras and Ras-related GTPases specifically Rab7 wildtype PubChem Bioassay (2009)[AID] 
Target
Name:
Ras-related protein Rab-7a
Synonyms:
GTP-binding protein (rab7) RAB7A | RAB7A_CANLF
Type:
Enzyme Catalytic Domain
Mol. Mass.:
23519.50
Organism:
Canis lupus familiaris
Description:
gi_164058
Residue:
207
  
Inhibitor
Name:
BDBM54615
Synonyms:
2-(2-methylphenyl)-3-(3-nitrophenyl)-5-phenyl-3,4-dihydropyrazole UNM-0000305854 | cid_2865667
Type:
Small organic molecule
Emp. Form.:
C22H19N3O2
Mol. Mass.:
357.4052
SMILES:
Cc1ccccc1[N+]1=N[C-](CC1c1cccc(c1)[N+]([O-])=O)c1ccccc1
: