Target
Ras-related protein Rab-7a
Ligand
BDBM54631
Substrate
Meas. Tech.
Pyrazoline SAR compounds tested via Multiplex dose response to identify specific small molecule inhibitors of Ras and Ras-related GTPases specifically Rab7 wildtype
EC50
30000±n/a nM
Citation
 PubChem, PC Pyrazoline SAR compounds tested via Multiplex dose response to identify specific small molecule inhibitors of Ras and Ras-related GTPases specifically Rab7 wildtype PubChem Bioassay (2009)[AID] 
Target
Name:
Ras-related protein Rab-7a
Synonyms:
GTP-binding protein (rab7) RAB7A | RAB7A_CANLF
Type:
Enzyme Catalytic Domain
Mol. Mass.:
23519.50
Organism:
Canis lupus familiaris
Description:
gi_164058
Residue:
207
  
Inhibitor
Name:
BDBM54631
Synonyms:
2-chloranyl-5-[3-(3,4-dimethoxyphenyl)-5-phenyl-3,4-dihydropyrazol-2-yl]benzoic acid 2-chloro-5-[5-(3,4-dimethoxyphenyl)-3-phenyl-2-pyrazolin-1-yl]benzoic acid cid_2975283
Type:
Small organic molecule
Emp. Form.:
C24H21ClN2O4
Mol. Mass.:
436.888
SMILES:
COc1ccc(cc1OC)C1CC(=NN1c1ccc(Cl)c(c1)C(O)=O)c1ccccc1
: