Target
Ras-related protein Rab-2A
Ligand
BDBM54616
Substrate
Meas. Tech.
Pyrazoline SAR compounds tested via Multiplex dose response to identify specific small molecule inhibitors of Ras and Ras-related GTPases specifically Rab2 wildtype
EC50
30000±n/a nM
Comments
Extracted from aid = 2045 and tid = 2
Citation
 PubChem, PC Pyrazoline SAR compounds tested via Multiplex dose response to identify specific small molecule inhibitors of Ras and Ras-related GTPases specifically Rab2 wildtype PubChem Bioassay (2016)[AID] 
Target
Name:
Ras-related protein Rab-2A
Synonyms:
RAB2 RAB2A_CANLF | Ras-related protein Rab-2A.
Type:
Enzyme Catalytic Domain
Mol. Mass.:
23545.28
Organism:
Canis lupus familiaris
Description:
gi_46577642
Residue:
212
  
Inhibitor
Name:
BDBM54616
Synonyms:
1-(2-methoxyphenyl)-3,5-diphenyl-2-pyrazoline UNM-0000305855 | cid_2865685
Type:
Small organic molecule
Emp. Form.:
C22H20N2O
Mol. Mass.:
328.407
SMILES:
COc1ccccc1N1N=C(CC1c1ccccc1)c1ccccc1
: