Target
GTPase KRas [1-37]
Ligand
BDBM54590
Substrate
Meas. Tech.
Pyrazoline SAR compounds tested via Multiplex dose response to identify specific small molecule inhibitors of Ras and Ras-related GTPases specifically Ras wildtype
EC50
30000±n/a nM
Citation
 PubChem, PC Pyrazoline SAR compounds tested via Multiplex dose response to identify specific small molecule inhibitors of Ras and Ras-related GTPases specifically Ras wildtype PubChem Bioassay (2009)[AID] 
Target
Name:
GTPase KRas [1-37]
Synonyms:
ras protein
Type:
Enzyme Catalytic Domain
Mol. Mass.:
4034.04
Organism:
Homo sapiens (Human)
Description:
gi_190938
Residue:
37
  
Inhibitor
Name:
BDBM54590
Synonyms:
1-(3-fluorophenyl)-3,5-bis(4-methoxyphenyl)-2-pyrazoline UNM-0000305828 | cid_2827701
Type:
Small organic molecule
Emp. Form.:
C23H21FN2O2
Mol. Mass.:
376.4234
SMILES:
COc1ccc(cc1)C1CC(=NN1c1cccc(F)c1)c1ccc(OC)cc1
: