Target
Ras-related C3 botulinum toxin substrate 1
Ligand
BDBM54606
Substrate
Meas. Tech.
Pyrazoline SAR compounds tested via Multiplex dose response to identify specific small molecule inhibitors of Ras and Ras-related GTPases specifically Rac1 activated mutant
EC50
30000±n/a nM
Citation
 PubChem, PC Pyrazoline SAR compounds tested via Multiplex dose response to identify specific small molecule inhibitors of Ras and Ras-related GTPases specifically Rac1 activated mutant PubChem Bioassay (2009)[AID] 
Target
Name:
Ras-related C3 botulinum toxin substrate 1
Synonyms:
RAC1_MOUSE Rac1 protein
Type:
PROTEIN
Mol. Mass.:
21455.91
Organism:
Mus musculus
Description:
EBI_101485
Residue:
192
  
Inhibitor
Name:
BDBM54606
Synonyms:
4-[3-(4-chlorophenyl)-5-phenyl-2-pyrazolin-1-yl]benzenesulfonamide UNM-0000305844 | cid_14199395
Type:
Small organic molecule
Emp. Form.:
C21H18ClN3O2S
Mol. Mass.:
411.905
SMILES:
NS(=O)(=O)c1ccc(cc1)N1N=C(CC1c1ccccc1)c1ccc(Cl)cc1
: