Target
Ras-related C3 botulinum toxin substrate 1
Ligand
BDBM54620
Substrate
Meas. Tech.
Pyrazoline SAR compounds tested via Multiplex dose response to identify specific small molecule inhibitors of Ras and Ras-related GTPases specifically Rac1 activated mutant
EC50
30000±n/a nM
Citation
 PubChem, PC Pyrazoline SAR compounds tested via Multiplex dose response to identify specific small molecule inhibitors of Ras and Ras-related GTPases specifically Rac1 activated mutant PubChem Bioassay (2009)[AID] 
Target
Name:
Ras-related C3 botulinum toxin substrate 1
Synonyms:
RAC1_MOUSE Rac1 protein
Type:
PROTEIN
Mol. Mass.:
21455.91
Organism:
Mus musculus
Description:
EBI_101485
Residue:
192
  
Inhibitor
Name:
BDBM54620
Synonyms:
3-(2-chlorophenyl)-5-(4-chlorophenyl)-2-[3-(trifluoromethyl)phenyl]-3,4-dihydropyrazole UNM-0000305859 | cid_2883040
Type:
Small organic molecule
Emp. Form.:
C22H15Cl2F3N2
Mol. Mass.:
435.269
SMILES:
FC(F)(F)c1cccc(c1)N1N=C(CC1c1ccccc1Cl)c1ccc(Cl)cc1
: