Target
Ras-related C3 botulinum toxin substrate 1
Ligand
BDBM54628
Substrate
Meas. Tech.
Pyrazoline SAR compounds tested via Multiplex dose response to identify specific small molecule inhibitors of Ras and Ras-related GTPases specifically Rac1 wildtype
EC50
30000±n/a nM
Citation
 PubChem, PC Pyrazoline SAR compounds tested via Multiplex dose response to identify specific small molecule inhibitors of Ras and Ras-related GTPases specifically Rac1 wildtype PubChem Bioassay (2009)[AID] 
Target
Name:
Ras-related C3 botulinum toxin substrate 1
Synonyms:
RAC1_MOUSE Rac1 protein
Type:
PROTEIN
Mol. Mass.:
21455.91
Organism:
Mus musculus
Description:
EBI_101485
Residue:
192
  
Inhibitor
Name:
BDBM54628
Synonyms:
3-(4-fluorophenyl)-5-(3-nitrophenyl)-1-phenyl-2-pyrazoline UNM-0000305867 | cid_2933589
Type:
Small organic molecule
Emp. Form.:
C21H16FN3O2
Mol. Mass.:
361.369
SMILES:
[O-][N+](=O)c1cccc(c1)C1C[C-](N=[N+]1c1ccccc1)c1ccc(F)cc1
: