Target
Tyrosine-protein phosphatase non-receptor type 7
Ligand
BDBM31755
Substrate
Meas. Tech.
MOA HePTP Fluorescent secondary assay for identification of redox-state modulating compounds
IC50
284±n/a nM
Citation
 PubChem, PC MOA HePTP Fluorescent secondary assay for identification of redox-state modulating compounds PubChem Bioassay (2009)[AID] 
Target
Name:
Tyrosine-protein phosphatase non-receptor type 7
Synonyms:
He-PTP Hematopoietic protein-tyrosine phosphatase (HEPTP) PTPN7 Tyrosine-protein phosphatase non-receptor type 7 | Tyrosine-protein phosphatase non-receptor type 7 (HEPTP)
Type:
Protein
Mol. Mass.:
40530.79
Organism:
Homo sapiens (Human)
Description:
P35236
Residue:
360
  
Inhibitor
Name:
BDBM31755
Synonyms:
3-(benzylthio)-5,6-bis(2-furyl)-1,2,4-triazine 5,6-bis(2-furanyl)-3-(phenylmethylthio)-1,2,4-triazine MLS-0029114.0001 | cid_2940938
Type:
Small organic molecule
Emp. Form.:
C18H13N3O2S
Mol. Mass.:
335.38
SMILES:
C(Sc1nnc(-c2ccco2)c(n1)-c1ccco1)c1ccccc1
: