Target
Tyrosine-protein phosphatase non-receptor type 7
Ligand
BDBM46222
Substrate
Meas. Tech.
MOA HePTP Fluorescent secondary assay for identification of redox-state modulating compounds
IC50
195±n/a nM
Citation
 PubChem, PC MOA HePTP Fluorescent secondary assay for identification of redox-state modulating compounds PubChem Bioassay (2009)[AID] 
Target
Name:
Tyrosine-protein phosphatase non-receptor type 7
Synonyms:
He-PTP Hematopoietic protein-tyrosine phosphatase (HEPTP) PTPN7 Tyrosine-protein phosphatase non-receptor type 7 | Tyrosine-protein phosphatase non-receptor type 7 (HEPTP)
Type:
Protein
Mol. Mass.:
40530.79
Organism:
Homo sapiens (Human)
Description:
P35236
Residue:
360
  
Inhibitor
Name:
BDBM46222
Synonyms:
3-(3-chloranyl-4-methoxy-phenyl)-1-(3-methylbutyl)-1-(1-propan-2-ylpiperidin-4-yl)thiourea 3-(3-chloro-4-methoxyphenyl)-1-(3-methylbutyl)-1-(1-propan-2-yl-4-piperidinyl)thiourea MLS-0330044.0001 | cid_24761488
Type:
Small organic molecule
Emp. Form.:
C21H34ClN3OS
Mol. Mass.:
412.032
SMILES:
COc1ccc(NC(=S)N(CCC(C)C)C2CCN(CC2)C(C)C)cc1Cl
: