Target
Dimer of Gag-Pol polyprotein [489-587]
Ligand
BDBM2207
Substrate
Peptide substrate
Meas. Tech.
Protease Inhibition Assay
Ki
25±n/a nM
Citation
 Prasad, JVBoyer, FEDomagala, JMEllsworth, ELGajda, CHamilton, HWHagen, SEMarkoski, LJSteinbaugh, BATait, BDHumblet, CLunney, EAPavlovsky, ARubin, JRFerguson, DGraham, NHoller, THupe, DNouhan, CTummino, PJUrumov, AZeikus, EZeikus, GGracheck, SJErickson, JW Nonpeptidic HIV protease inhibitors possessing excellent antiviral activities and therapeutic indices. PD 178390: a lead HIV protease inhibitor. Bioorg Med Chem 7:2775-800 (1999)  
Target
Name:
Dimer of Gag-Pol polyprotein [489-587]
Synonyms:
HIV-1 Protease
Type:
Protein Complex
Mol. Mass.:
Description:
Components:
This complex has 2 components.
Component 1
Name:
Gag-Pol polyprotein [489-587]
Synonyms:
HIV protease HIV-1 Protease chain A POL_HV1N5 | gag-pol
Type:
Enzyme Subunit
Mol. Mass.:
10822.21
Organism:
Human immunodeficiency virus type 1
Description:
P12497[489-587]
Residue:
99
  
Component 2
Name:
Gag-Pol polyprotein [489-587]
Synonyms:
HIV protease HIV-1 Protease chain A POL_HV1N5 | gag-pol
Type:
Enzyme Subunit
Mol. Mass.:
10822.21
Organism:
Human immunodeficiency virus type 1
Description:
P12497[489-587]
Residue:
99
  
Inhibitor
Name:
BDBM2207
Synonyms:
(6R)-6-[2-(4-aminophenyl)ethyl]-3-{[2-tert-butyl-4-(hydroxymethyl)-5-methylphenyl]sulfanyl}-4-hydroxy-6-(propan-2-yl)-5,6-dihydro-2H-pyran-2-one PD 178390 Analog 34R
Type:
Small organic molecule
Emp. Form.:
C28H37NO4S
Mol. Mass.:
483.663
SMILES:
CC(C)[C@@]1(CCc2ccc(N)cc2)CC(=O)C(Sc2cc(C)c(CO)cc2C(C)(C)C)C(=O)O1
:
Substrate
Name:
Peptide substrate
Synonyms:
Type:
Peptide
Mol. Mass.:
4517.01
Organism:
Description:
Residue:
41