Target
Kappa-type opioid receptor
Ligand
BDBM54798
Substrate
Meas. Tech.
HTS Image-Based Screen for Selective Antagonists of the KOR Receptor
IC50
18118±2680 nM
Citation
 PubChem, PC HTS Image-Based Screen for Selective Antagonists of the KOR Receptor PubChem Bioassay (2009)[AID] 
Target
Name:
Kappa-type opioid receptor
Synonyms:
K-OR-1 Kappa-opioid receptor (KOR) Kappa-type opioid receptor (KOR) OPIATE Kappa OPRK1 kappa opioid receptor (KOR)
Type:
G Protein-Coupled Receptor (GPCR)
Mol. Mass.:
42648.76
Organism:
Homo sapiens (Human)
Description:
P41145
Residue:
380
  
Inhibitor
Name:
BDBM54798
Synonyms:
(5Z)-2-azanylidene-5-[(2-methyl-1H-indol-3-yl)methylidene]-3-(1,3-thiazol-2-yl)-1,3-thiazolidin-4-one (5Z)-2-imino-5-[(2-methyl-1H-indol-3-yl)methylidene]-3-(1,3-thiazol-2-yl)-1,3-thiazolidin-4-one MLS000519510 cid_5291664
Type:
Small organic molecule
Emp. Form.:
C16H12N4OS2
Mol. Mass.:
340.423
SMILES:
Cc1[nH]c2ccccc2c1\C=C1/SC(=N)N(C1=O)c1nccs1
: