Target
Genome polyprotein
Ligand
BDBM37660
Substrate
Meas. Tech.
Fluorescence-based biochemical high throughput dose response assay for inhibitors of the Hepatitis C Virus non-structural protein 3 helicase (NS3).
IC50
6355±n/a nM
Citation
 PubChem, PC Fluorescence-based biochemical high throughput dose response assay for inhibitors of the Hepatitis C Virus non-structural protein 3 helicase (NS3). PubChem Bioassay (2009)[AID] 
Target
Name:
Genome polyprotein
Synonyms:
NS3
Type:
Enzyme Catalytic Domain
Mol. Mass.:
67067.41
Organism:
Hepatitis C virus
Description:
gi_125541954
Residue:
631
  
Inhibitor
Name:
BDBM37660
Synonyms:
(4Z)-1-(4,5-dimethyl-1,3-thiazol-2-yl)-4-[(4-ethoxyphenyl)-hydroxymethylidene]-5-(furan-2-yl)pyrrolidine-2,3-dione (4Z)-1-(4,5-dimethyl-2-thiazolyl)-4-[(4-ethoxyphenyl)-hydroxymethylidene]-5-(2-furanyl)pyrrolidine-2,3-dione MLS000081062 cid_5389606
Type:
Small organic molecule
Emp. Form.:
C22H20N2O5S
Mol. Mass.:
424.47
SMILES:
CCOc1ccc(cc1)C(=O)C1C(N(C(=O)C1=O)c1nc(C)c(C)s1)c1ccco1
: