Target
Genome polyprotein
Ligand
BDBM32310
Substrate
Meas. Tech.
Fluorescence-based biochemical high throughput dose response assay for inhibitors of the Hepatitis C Virus non-structural protein 3 helicase (NS3).
IC50
3908±n/a nM
Citation
 PubChem, PC Fluorescence-based biochemical high throughput dose response assay for inhibitors of the Hepatitis C Virus non-structural protein 3 helicase (NS3). PubChem Bioassay (2009)[AID] 
Target
Name:
Genome polyprotein
Synonyms:
NS3
Type:
Enzyme Catalytic Domain
Mol. Mass.:
67067.41
Organism:
Hepatitis C virus
Description:
gi_125541954
Residue:
631
  
Inhibitor
Name:
BDBM32310
Synonyms:
MLS000390238 cid_6311834
Type:
Small organic molecule
Emp. Form.:
C25H23N3O4S
Mol. Mass.:
461.533
SMILES:
Nc1c(sc2nc3\C(CCc3c(-c3ccco3)c12)=C\c1ccco1)C(=O)NCC1CCCO1
: