Target
Genome polyprotein
Ligand
BDBM48854
Substrate
Meas. Tech.
Fluorescence-based biochemical high throughput dose response assay for inhibitors of the Hepatitis C Virus non-structural protein 3 helicase (NS3).
IC50
5306±n/a nM
Citation
 PubChem, PC Fluorescence-based biochemical high throughput dose response assay for inhibitors of the Hepatitis C Virus non-structural protein 3 helicase (NS3). PubChem Bioassay (2009)[AID] 
Target
Name:
Genome polyprotein
Synonyms:
NS3
Type:
Enzyme Catalytic Domain
Mol. Mass.:
67067.41
Organism:
Hepatitis C virus
Description:
gi_125541954
Residue:
631
  
Inhibitor
Name:
BDBM48854
Synonyms:
(6E)-2-(2-furanyl)-5-imino-6-[[1-(4-methylphenyl)-2-pyrrolyl]methylidene]-[1,3,4]thiadiazolo[3,2-a]pyrimidin-7-one (6E)-2-(2-furyl)-5-imino-6-{[1-(4-methylphenyl)-1H-pyrrol-2-yl]methylene}-5,6-dihydro-7H-[1,3,4]thiadiazolo[3,2-a]pyrimidin-7-one (6E)-5-azanylidene-2-(furan-2-yl)-6-[[1-(4-methylphenyl)pyrrol-2-yl]methylidene]-[1,3,4]thiadiazolo[3,2-a]pyrimidin-7-one SMR000309172 | cid_16194424
Type:
Small organic molecule
Emp. Form.:
C21H15N5O2S
Mol. Mass.:
401.441
SMILES:
Cc1ccc(cc1)-n1cccc1\C=C1\C(=O)N=C2SC(=NN2C1=N)c1ccco1
: