Target
Genome polyprotein
Ligand
BDBM55047
Substrate
Meas. Tech.
Fluorescence-based biochemical high throughput dose response assay for inhibitors of the Hepatitis C Virus non-structural protein 3 helicase (NS3).
IC50
7068±n/a nM
Citation
 PubChem, PC Fluorescence-based biochemical high throughput dose response assay for inhibitors of the Hepatitis C Virus non-structural protein 3 helicase (NS3). PubChem Bioassay (2009)[AID] 
Target
Name:
Genome polyprotein
Synonyms:
NS3
Type:
Enzyme Catalytic Domain
Mol. Mass.:
67067.41
Organism:
Hepatitis C virus
Description:
gi_125541954
Residue:
631
  
Inhibitor
Name:
BDBM55047
Synonyms:
4-[[4-[(E)-2-cyano-3-oxidanylidene-3-[(phenylmethyl)amino]prop-1-enyl]phenoxy]methyl]benzoic acid 4-[[4-[(E)-3-(benzylamino)-2-cyano-3-keto-prop-1-enyl]phenoxy]methyl]benzoic acid MLS001195203 cid_5894323
Type:
Small organic molecule
Emp. Form.:
C25H20N2O4
Mol. Mass.:
412.4373
SMILES:
OC(=O)c1ccc(COc2ccc(\C=C(/C#N)C(=O)NCc3ccccc3)cc2)cc1
: