Target
Gag-Pol polyprotein [588-1027]/[588-1147]
Ligand
BDBM2222
Substrate
(poly)rC:(oligo)dG
Meas. Tech.
HIV-1 RT Assay
pH
8.2±n/a
IC50
23±n/a nM
Citation
 Saari, WSHoffman, JMWai, JSFisher, TERooney, CSSmith, AMThomas, CMGoldman, MEO'Brien, JANunberg, JH 2-Pyridinone derivatives: a new class of nonnucleoside, HIV-1-specific reverse transcriptase inhibitors. J Med Chem 34:2922-5 (1991)  
Target
Name:
Gag-Pol polyprotein [588-1027]/[588-1147]
Synonyms:
EC: 2.7.7.49 | HIV-1 Reverse Transcriptase
Type:
Protein Complex
Mol. Mass.:
115684
Description:
Components:
This complex has 2 components.
Component 1
Name:
Gag-Pol polyprotein [588-1147]
Synonyms:
HIV-1 Reverse Transcriptase Chain A gag-pol
Type:
Enzyme Subunit
Mol. Mass.:
64486.41
Organism:
Human immunodeficiency virus type 1
Description:
P04585[588-1147]
Residue:
560
  
Component 2
Name:
Gag-Pol polyprotein [588-1027]
Synonyms:
HIV-1 Reverse Transcriptase Chain B gag-pol
Type:
Enzyme Subunit
Mol. Mass.:
51337.13
Organism:
Human immunodeficiency virus type 1
Description:
P04585[588-1027]
Residue:
440
  
Inhibitor
Name:
BDBM2222
Synonyms:
2-Pyridinone derivative 20 CHEMBL329720 | Pyridinone deriv. 15
Type:
Small organic molecule
Emp. Form.:
C19H22N2O2
Mol. Mass.:
310.3902
SMILES:
CCc1cc(CCc2nc3c(C)ccc(C)c3o2)c(=O)[nH]c1C
:
Substrate
Name:
(poly)rC:(oligo)dG
Synonyms:
Type:
RNA-DNA duplex
Mol. Mass.:
358.43
Organism:
Description:
The incorporation of Tritium-labeled [3H]dGTP onto a (poly)rC:(oligo)dG template:primer.
Residue:
3
NA