Target
Metabotropic glutamate receptor 1
Ligand
BDBM55081
Substrate
Meas. Tech.
Modulation of the Metabotropic Glutamate Receptor mGluR4: Selectivity at mGluR1
EC50
1449.8073±n/a nM
Citation
 PubChem, PC Modulation of the Metabotropic Glutamate Receptor mGluR4: Selectivity at mGluR1 PubChem Bioassay (2010)[AID] 
Target
Name:
Metabotropic glutamate receptor 1
Synonyms:
GRM1_RAT Grm1 Metabotropic glutamate receptor Mglur1 metabotropic glutamate 1/5-D metabotropic glutamate receptor 1 isoform alpha precursor
Type:
Enzyme Catalytic Domain
Mol. Mass.:
133240.47
Organism:
RAT
Description:
metabotropic glutamate 1/2 0 RAT::P23385
Residue:
1199
  
Inhibitor
Name:
BDBM55081
Synonyms:
ML182 cid_46869947
Type:
Small organic molecule
Emp. Form.:
C21H16ClN3O3
Mol. Mass.:
393.823
SMILES:
[H][C@@]12C[C@@]([H])(C=C1)[C@]1([H])C2C(=O)N(C1=O)c1ccc(NC(=O)c2ccccn2)cc1Cl
: