Target
Neutrophil cytosol factor 1 [S99G]
Ligand
BDBM55334
Substrate
Meas. Tech.
Dose Response Confirmation for small molecular inhibitors for p47phox, a regulatory protein of NADPH oxidases (Noxs)
IC50
50000±n/a nM
Citation
 PubChem, PC Dose Response Confirmation for small molecular inhibitors for p47phox, a regulatory protein of NADPH oxidases (Noxs) PubChem Bioassay (2008)[AID] 
Target
Name:
Neutrophil cytosol factor 1 [S99G]
Synonyms:
NCF1 NOXO2 neutrophil cytosolic factor 1
Type:
Enzyme Catalytic Domain
Mol. Mass.:
44664.39
Organism:
Homo sapiens (Human)
Description:
gi_115298672
Residue:
390
  
Inhibitor
Name:
BDBM55334
Synonyms:
6-chloranyl-4-pyridin-2-yl-3a,4,5,9b-tetrahydro-3H-cyclopenta[c]quinoline-9-carboxylic acid 6-chloro-4-(2-pyridyl)-3a,4,5,9b-tetrahydro-3H-cyclopenta[c]quinoline-9-carboxylic acid MLS000120578 cid_3154407
Type:
Small organic molecule
Emp. Form.:
C18H15ClN2O2
Mol. Mass.:
326.777
SMILES:
OC(=O)c1ccc(Cl)c2NC(C3CC=CC3c12)c1ccccn1
: