Target
Neutrophil cytosol factor 1 [S99G]
Ligand
BDBM55409
Substrate
Meas. Tech.
Dose Response Confirmation for small molecular inhibitors for p47phox, a regulatory protein of NADPH oxidases (Noxs)
IC50
50000±n/a nM
Citation
 PubChem, PC Dose Response Confirmation for small molecular inhibitors for p47phox, a regulatory protein of NADPH oxidases (Noxs) PubChem Bioassay (2008)[AID] 
Target
Name:
Neutrophil cytosol factor 1 [S99G]
Synonyms:
NCF1 NOXO2 neutrophil cytosolic factor 1
Type:
Enzyme Catalytic Domain
Mol. Mass.:
44664.39
Organism:
Homo sapiens (Human)
Description:
gi_115298672
Residue:
390
  
Inhibitor
Name:
BDBM55409
Synonyms:
2-phenoxy-N-(5-tetralin-6-yl-1,3,4-oxadiazol-2-yl)acetamide 2-phenoxy-N-[5-(5,6,7,8-tetrahydronaphthalen-2-yl)-1,3,4-oxadiazol-2-yl]ethanamide SMR000126873 | cid_3373841
Type:
Small organic molecule
Emp. Form.:
C20H19N3O3
Mol. Mass.:
349.3832
SMILES:
O=C(COc1ccccc1)Nc1nnc(o1)-c1ccc2CCCCc2c1
: