Target
Streptokinase A
Ligand
BDBM50624
Substrate
Meas. Tech.
Absorbance Microorganism-Based Dose Response HTS to Identify Inhibitors of Streptokinase Expression
EC50
16436±n/a nM
Citation
 PubChem, PC Absorbance Microorganism-Based Dose Response HTS to Identify Inhibitors of Streptokinase Expression PubChem Bioassay (2009)[AID] 
Target
Name:
Streptokinase A
Synonyms:
STRP_STRP1 streptokinase A precursor
Type:
Enzyme Catalytic Domain
Mol. Mass.:
49924.80
Organism:
Streptococcus pyogenes M1 GAS
Description:
gi_15675770
Residue:
440
  
Inhibitor
Name:
BDBM50624
Synonyms:
MLS000775572 cid_2545377
Type:
Small organic molecule
Emp. Form.:
C24H20N2O6S2
Mol. Mass.:
496.555
SMILES:
COc1ccc(O)c(c1)C(=O)c1cc(SCC(O)=O)c2nc3sc4CCCCc4c3c(=O)n2c1
: