Target
Streptokinase A
Ligand
BDBM51877
Substrate
Meas. Tech.
Absorbance Microorganism-Based Dose Response HTS to Identify Inhibitors of Streptokinase Expression
EC50
150000±n/a nM
Citation
 PubChem, PC Absorbance Microorganism-Based Dose Response HTS to Identify Inhibitors of Streptokinase Expression PubChem Bioassay (2009)[AID] 
Target
Name:
Streptokinase A
Synonyms:
STRP_STRP1 streptokinase A precursor
Type:
Enzyme Catalytic Domain
Mol. Mass.:
49924.80
Organism:
Streptococcus pyogenes M1 GAS
Description:
gi_15675770
Residue:
440
  
Inhibitor
Name:
BDBM51877
Synonyms:
3-[[5-tert-butyl-3-(4-chlorophenyl)pyrazolo[1,5-a]pyrimidin-7-yl]amino]propyl-dimethyl-amine N'-[5-tert-Butyl-3-(4-chloro-phenyl)-pyrazolo[1,5-a]pyrimidin-7-yl]-N,N-dimethyl-propane-1,3-diamine N-[5-tert-butyl-3-(4-chlorophenyl)pyrazolo[1,5-a]pyrimidin-7-yl]-N',N'-dimethyl-propane-1,3-diamine SMR000439716 | cid_2035190
Type:
Small organic molecule
Emp. Form.:
C21H28ClN5
Mol. Mass.:
385.934
SMILES:
CN(C)CCCNc1cc(nc2c(cnn12)-c1ccc(Cl)cc1)C(C)(C)C
: