Target
Streptokinase A
Ligand
BDBM58087
Substrate
Meas. Tech.
Absorbance Microorganism-Based Dose Response HTS to Identify Inhibitors of Streptokinase Expression
EC50
150000±n/a nM
Citation
 PubChem, PC Absorbance Microorganism-Based Dose Response HTS to Identify Inhibitors of Streptokinase Expression PubChem Bioassay (2009)[AID] 
Target
Name:
Streptokinase A
Synonyms:
STRP_STRP1 streptokinase A precursor
Type:
Enzyme Catalytic Domain
Mol. Mass.:
49924.80
Organism:
Streptococcus pyogenes M1 GAS
Description:
gi_15675770
Residue:
440
  
Inhibitor
Name:
BDBM58087
Synonyms:
2-Cyclohexyl-3-(4-methoxy-benzyl)-10-methyl-3H,10H-pyrimido[4,5-b]quinoline-4,5-dione 2-cyclohexyl-3-[(4-methoxyphenyl)methyl]-10-methyl-pyrimido[4,5-b]quinoline-4,5-dione MLS000763169 cid_2028520
Type:
Small organic molecule
Emp. Form.:
C26H27N3O3
Mol. Mass.:
429.5109
SMILES:
COc1ccc(Cn2c(nc3n(C)c4ccccc4c(=O)c3c2=O)C2CCCCC2)cc1
: