Target
Streptokinase A
Ligand
BDBM58091
Substrate
Meas. Tech.
Absorbance Microorganism-Based Dose Response HTS to Identify Inhibitors of Streptokinase Expression
EC50
5233±n/a nM
Citation
 PubChem, PC Absorbance Microorganism-Based Dose Response HTS to Identify Inhibitors of Streptokinase Expression PubChem Bioassay (2009)[AID] 
Target
Name:
Streptokinase A
Synonyms:
STRP_STRP1 streptokinase A precursor
Type:
Enzyme Catalytic Domain
Mol. Mass.:
49924.80
Organism:
Streptococcus pyogenes M1 GAS
Description:
gi_15675770
Residue:
440
  
Inhibitor
Name:
BDBM58091
Synonyms:
2-(1-isoquinolinyl)-4,5-diphenyloxazole 2-isoquinolin-1-yl-4,5-diphenyl-1,3-oxazole SMR000393717 | cid_230513
Type:
Small organic molecule
Emp. Form.:
C24H16N2O
Mol. Mass.:
348.3966
SMILES:
c1ccc(cc1)-c1nc(oc1-c1ccccc1)-c1nccc2ccccc12
: