Target
Streptokinase A
Ligand
BDBM58490
Substrate
Meas. Tech.
Absorbance Microorganism-Based Dose Response HTS to Identify Inhibitors of Streptokinase Expression
EC50
150000±n/a nM
Citation
 PubChem, PC Absorbance Microorganism-Based Dose Response HTS to Identify Inhibitors of Streptokinase Expression PubChem Bioassay (2009)[AID] 
Target
Name:
Streptokinase A
Synonyms:
STRP_STRP1 streptokinase A precursor
Type:
Enzyme Catalytic Domain
Mol. Mass.:
49924.80
Organism:
Streptococcus pyogenes M1 GAS
Description:
gi_15675770
Residue:
440
  
Inhibitor
Name:
BDBM58490
Synonyms:
(7S,9S)-7-[(2R,4S,5S,6S)-4-azanyl-6-methyl-5-oxidanyl-oxan-2-yl]oxy-9-ethanoyl-6,9,11-tris(oxidanyl)-8,10-dihydro-7H-tetracene-5,12-dione;hydrochloride (7S,9S)-9-acetyl-7-[(2R,4S,5S,6S)-4-amino-5-hydroxy-6-methyloxan-2-yl]oxy-6,9,11-trihydroxy-8,10-dihydro-7H-tetracene-5,12-dione;hydrochloride IDAMYCIN IDARUBICIN HYDROCHLORIDE SMR000466355 | cid_636362
Type:
Small organic molecule
Emp. Form.:
C26H27NO9
Mol. Mass.:
497.4939
SMILES:
C[C@@H]1O[C@H](C[C@H](N)[C@@H]1O)O[C@H]1C[C@@](O)(Cc2c(O)c3C(=O)c4ccccc4C(=O)c3c(O)c12)C(C)=O
: