Target
Streptokinase A
Ligand
BDBM58941
Substrate
Meas. Tech.
Absorbance Microorganism-Based Dose Response HTS to Identify Inhibitors of Streptokinase Expression
EC50
19640±n/a nM
Citation
 PubChem, PC Absorbance Microorganism-Based Dose Response HTS to Identify Inhibitors of Streptokinase Expression PubChem Bioassay (2009)[AID] 
Target
Name:
Streptokinase A
Synonyms:
STRP_STRP1 streptokinase A precursor
Type:
Enzyme Catalytic Domain
Mol. Mass.:
49924.80
Organism:
Streptococcus pyogenes M1 GAS
Description:
gi_15675770
Residue:
440
  
Inhibitor
Name:
BDBM58941
Synonyms:
CHEMBL307346 MLS001333620 cetyl(trimethyl)ammonium;hydroxide;hydrate hexadecyl(trimethyl)ammonium;hydroxide;hydrate | hexadecyl(trimethyl)azanium;hydroxide;hydrate
Type:
Small organic molecule
Emp. Form.:
C19H42N
Mol. Mass.:
284.5429
SMILES:
CCCCCCCCCCCCCCCC[N+](C)(C)C
: