Target
Large T antigen
Ligand
BDBM58954
Substrate
Meas. Tech.
Identification of SV40 T antigen inhibitors: Cytotoxicity screen of selected hits
EC50
>50000±n/a nM
Citation
 PubChem, PC Identification of SV40 T antigen inhibitors: Cytotoxicity screen of selected hits PubChem Bioassay (2009)[AID] 
Target
Name:
Large T antigen
Synonyms:
LT LT_SV40
Type:
Enzyme Catalytic Domain
Mol. Mass.:
81575.54
Organism:
Simian virus 40
Description:
P03070
Residue:
708
  
Inhibitor
Name:
BDBM58954
Synonyms:
MLS000094393 N-[2-[4-(4-methoxyphenyl)piperazin-1-yl]-2-pyridin-3-yl-ethyl]cyclohexanecarboxamide N-[2-[4-(4-methoxyphenyl)piperazino]-2-(3-pyridyl)ethyl]cyclohexanecarboxamide SMR000029972 | cid_3240844
Type:
Small organic molecule
Emp. Form.:
C25H34N4O2
Mol. Mass.:
422.5631
SMILES:
COc1ccc(cc1)N1CCN(CC1)C(CNC(=O)C1CCCCC1)c1cccnc1
: