Target
Large T antigen
Ligand
BDBM34679
Substrate
Meas. Tech.
Identification of SV40 T antigen inhibitors: Cytotoxicity screen of selected hits
EC50
>50000±n/a nM
Citation
 PubChem, PC Identification of SV40 T antigen inhibitors: Cytotoxicity screen of selected hits PubChem Bioassay (2009)[AID] 
Target
Name:
Large T antigen
Synonyms:
LT LT_SV40
Type:
Enzyme Catalytic Domain
Mol. Mass.:
81575.54
Organism:
Simian virus 40
Description:
P03070
Residue:
708
  
Inhibitor
Name:
BDBM34679
Synonyms:
1-[[1-(4-methoxyphenyl)-3-pyrrolidinyl]methyl]-3-phenylurea 1-[[1-(4-methoxyphenyl)pyrrolidin-3-yl]methyl]-3-phenylurea SMR000131590 | cid_4246400
Type:
Small organic molecule
Emp. Form.:
C19H23N3O2
Mol. Mass.:
325.4048
SMILES:
COc1ccc(cc1)N1CCC(CNC(=O)Nc2ccccc2)C1
: