Target
Large T antigen
Ligand
BDBM29680
Substrate
Meas. Tech.
Identification of SV40 T antigen inhibitors: Cytotoxicity screen of selected hits
EC50
18160±n/a nM
Citation
 PubChem, PC Identification of SV40 T antigen inhibitors: Cytotoxicity screen of selected hits PubChem Bioassay (2009)[AID] 
Target
Name:
Large T antigen
Synonyms:
LT LT_SV40
Type:
Enzyme Catalytic Domain
Mol. Mass.:
81575.54
Organism:
Simian virus 40
Description:
P03070
Residue:
708
  
Inhibitor
Name:
BDBM29680
Synonyms:
2-[(6,7-dihydroxy-2-keto-chromen-4-yl)methylthio]-3-(3-methoxyphenyl)quinazolin-4-one 2-[(6,7-dihydroxy-2-oxochromen-4-yl)methylsulfanyl]-3-(3-methoxyphenyl)quinazolin-4-one MLS000409303 cid_5691857
Type:
Small organic molecule
Emp. Form.:
C25H18N2O6S
Mol. Mass.:
474.485
SMILES:
COc1cccc(c1)-n1c(SCc2cc(=O)oc3cc(O)c(O)cc23)nc2ccccc2c1=O
: