Target
Adenosine receptor A1
Ligand
BDBM50106539
Substrate
Meas. Tech.
Binding Assay
Ki
245±48 nM
Citation
 Jacobson, KAOhno, MDuong, HTKim, SKTchilibon, SCesnek, MHolý, AGao, ZG A neoceptor approach to unraveling microscopic interactions between the human A2A adenosine receptor and its agonists. Chem Biol 12:237-47 (2005)  
Target
Name:
Adenosine receptor A1
Synonyms:
A1 adenosine receptor (hA1) AA1R_HUMAN ADORA1 Adenosine A1-receptor Adenosine receptor A1 (hA1) | Adenosine transporter (AdT)
Type:
G Protein-Coupled Receptor (GPCR)
Mol. Mass.:
36520.92
Organism:
Homo sapiens (Human)
Description:
P30542
Residue:
326
  
Inhibitor
Name:
BDBM50106539
Synonyms:
(2S,3S,4R,5R)-5-(6-Amino-purin-9-yl)-3,4-dihydroxy-tetrahydro-furan-2-carboxylic acid (2-amino-ethyl)-amide 5'-N-[(2-AMINO)ETHYL CARBOXAMIDO] ADENOSINE Adenosine analog, 1 | CHEMBL129903
Type:
Small organic molecule
Emp. Form.:
C12H17N7O4
Mol. Mass.:
323.3079
SMILES:
NCCNC(=O)[C@H]1O[C@H]([C@H](O)[C@@H]1O)n1cnc2c(N)ncnc12
: