Target
Gag-Pol polyprotein [588-1027,K690N]/[588-1147,K690N]
Ligand
BDBM2284
Substrate
(poly)rC:(oligo)dG
Meas. Tech.
HIV-1 RT Assay
pH
8.2±n/a
IC50
1460±n/a nM
Citation
 Williams, TMCiccarone, TMMacTough, SCRooney, CSBalani, SKCondra, JHEmini, EAGoldman, MEGreenlee, WJKauffman, LR 5-chloro-3-(phenylsulfonyl)indole-2-carboxamide: a novel, non-nucleoside inhibitor of HIV-1 reverse transcriptase. J Med Chem 36:1291-4 (1993)  
Target
Name:
Gag-Pol polyprotein [588-1027,K690N]/[588-1147,K690N]
Synonyms:
EC: 2.7.7.49 | HIV-1 Reverse Transcriptase Mutant (K103N)
Type:
Protein Complex
Mol. Mass.:
Description:
Components:
This complex has 2 components.
Component 1
Name:
Gag-Pol polyprotein [588-1147,K690N]
Synonyms:
HIV-1 Reverse Transcriptase Mutant (K103N) Chain A gag-pol
Type:
Enzyme Subunit
Mol. Mass.:
64471.33
Organism:
Human immunodeficiency virus type 1
Description:
P04585[588-1147,K690N]
Residue:
560
  
Component 2
Name:
Gag-Pol polyprotein [588-1027,K690N]
Synonyms:
HIV-1 Reverse Transcriptase Mutant (K103N) Chain B gag-pol
Type:
Enzyme Subunit
Mol. Mass.:
51280.01
Organism:
Human immunodeficiency virus type 1
Description:
P04585[588-1027,K690N]
Residue:
440
  
Inhibitor
Name:
BDBM2284
Synonyms:
5-chloro-3-(phenylsulfanyl)-1H-indole-2-carboxamide | 5Cl3PhS-2IndolCONH2 inhibitor 10
Type:
Small organic molecule
Emp. Form.:
C15H11ClN2OS
Mol. Mass.:
302.779
SMILES:
NC(=O)c1[nH]c2ccc(Cl)cc2c1Sc1ccccc1
:
Substrate
Name:
(poly)rC:(oligo)dG
Synonyms:
Type:
RNA-DNA duplex
Mol. Mass.:
358.43
Organism:
Description:
The incorporation of Tritium-labeled [3H]dGTP onto a (poly)rC:(oligo)dG template:primer.
Residue:
3
NA