Target
Alkaline phosphatase, tissue-nonspecific isozyme
Ligand
BDBM59259
Substrate
Meas. Tech.
uHTS identification of compounds activating TNAP in the absence of phosphate acceptor performed in luminescent assay
EC50
100000±n/a nM
Citation
 PubChem, PC uHTS identification of compounds activating TNAP in the absence of phosphate acceptor performed in luminescent assay PubChem Bioassay (2009)[AID] 
Target
Name:
Alkaline phosphatase, tissue-nonspecific isozyme
Synonyms:
ALPL tissue-nonspecific alkaline phosphatase precursor
Type:
PROTEIN
Mol. Mass.:
57306.17
Organism:
Homo sapiens (Human)
Description:
ChEMBL_1448917
Residue:
524
  
Inhibitor
Name:
BDBM59259
Synonyms:
5-amino-4-(1H-benzimidazol-2-yl)-1-butyl-2-pyrrolin-3-one 5-azanyl-4-(1H-benzimidazol-2-yl)-1-butyl-2H-pyrrol-3-one SMR000047785 | cid_666506
Type:
Small organic molecule
Emp. Form.:
C15H18N4O
Mol. Mass.:
270.3296
SMILES:
CCCCn1cc(O)c(c1N)-c1nc2ccccc2[nH]1
: