Target
Alkaline phosphatase, tissue-nonspecific isozyme
Ligand
BDBM38931
Substrate
Meas. Tech.
uHTS identification of compounds activating TNAP in the absence of phosphate acceptor performed in luminescent assay
EC50
45686±n/a nM
Citation
 PubChem, PC uHTS identification of compounds activating TNAP in the absence of phosphate acceptor performed in luminescent assay PubChem Bioassay (2009)[AID] 
Target
Name:
Alkaline phosphatase, tissue-nonspecific isozyme
Synonyms:
ALPL tissue-nonspecific alkaline phosphatase precursor
Type:
PROTEIN
Mol. Mass.:
57306.17
Organism:
Homo sapiens (Human)
Description:
ChEMBL_1448917
Residue:
524
  
Inhibitor
Name:
BDBM38931
Synonyms:
6-methyl-2-[3-methyl-5-(4-methylanilino)-1-pyrazolyl]-1H-pyrimidin-4-one 6-methyl-2-[3-methyl-5-(p-toluidino)pyrazol-1-yl]-1H-pyrimidin-4-one MLS000036000 cid_2408467
Type:
Small organic molecule
Emp. Form.:
C16H17N5O
Mol. Mass.:
295.3391
SMILES:
Cc1cc(Nc2ccc(C)cc2)n(n1)-c1nc(C)cc(=O)[nH]1
: