Target
Alkaline phosphatase, tissue-nonspecific isozyme
Ligand
BDBM59265
Substrate
Meas. Tech.
uHTS identification of compounds activating TNAP in the absence of phosphate acceptor performed in luminescent assay
EC50
73926±n/a nM
Citation
 PubChem, PC uHTS identification of compounds activating TNAP in the absence of phosphate acceptor performed in luminescent assay PubChem Bioassay (2009)[AID] 
Target
Name:
Alkaline phosphatase, tissue-nonspecific isozyme
Synonyms:
ALPL tissue-nonspecific alkaline phosphatase precursor
Type:
PROTEIN
Mol. Mass.:
57306.17
Organism:
Homo sapiens (Human)
Description:
ChEMBL_1448917
Residue:
524
  
Inhibitor
Name:
BDBM59265
Synonyms:
1-(2-furoylamino)-3-isobutyl-thiourea 1-(furan-2-ylcarbonylamino)-3-(2-methylpropyl)thiourea 2-(2-furoyl)-N-isobutylhydrazinecarbothioamide SMR000115036 | cid_1767443
Type:
Small organic molecule
Emp. Form.:
C10H15N3O2S
Mol. Mass.:
241.31
SMILES:
CC(C)CNC(=S)NNC(=O)c1ccco1
: