Target
Alkaline phosphatase, tissue-nonspecific isozyme
Ligand
BDBM59270
Substrate
Meas. Tech.
uHTS identification of compounds activating TNAP in the absence of phosphate acceptor performed in luminescent assay
EC50
100000±n/a nM
Citation
 PubChem, PC uHTS identification of compounds activating TNAP in the absence of phosphate acceptor performed in luminescent assay PubChem Bioassay (2009)[AID] 
Target
Name:
Alkaline phosphatase, tissue-nonspecific isozyme
Synonyms:
ALPL tissue-nonspecific alkaline phosphatase precursor
Type:
PROTEIN
Mol. Mass.:
57306.17
Organism:
Homo sapiens (Human)
Description:
ChEMBL_1448917
Residue:
524
  
Inhibitor
Name:
BDBM59270
Synonyms:
1-(2-fluorophenyl)-4-phenyl-3-(2-thienyl)-2-pyrazoline 2-(2-fluorophenyl)-4-phenyl-5-thiophen-2-yl-3,4-dihydropyrazole SMR000137029 | cid_2842535
Type:
Small organic molecule
Emp. Form.:
C19H15FN2S
Mol. Mass.:
322.399
SMILES:
Fc1ccccc1N1CC(C(=N1)c1cccs1)c1ccccc1
: