Target
Alkaline phosphatase, tissue-nonspecific isozyme
Ligand
BDBM59273
Substrate
Meas. Tech.
uHTS identification of compounds activating TNAP in the absence of phosphate acceptor performed in luminescent assay
EC50
63637±n/a nM
Citation
 PubChem, PC uHTS identification of compounds activating TNAP in the absence of phosphate acceptor performed in luminescent assay PubChem Bioassay (2009)[AID] 
Target
Name:
Alkaline phosphatase, tissue-nonspecific isozyme
Synonyms:
ALPL tissue-nonspecific alkaline phosphatase precursor
Type:
PROTEIN
Mol. Mass.:
57306.17
Organism:
Homo sapiens (Human)
Description:
ChEMBL_1448917
Residue:
524
  
Inhibitor
Name:
BDBM59273
Synonyms:
4-keto-N,N,5-trimethyl-2-(2-pyridyl)-3H-thieno[2,3-d]pyrimidine-6-carboxamide N,N,5-trimethyl-4-oxidanylidene-2-pyridin-2-yl-3H-thieno[2,3-d]pyrimidine-6-carboxamide N,N,5-trimethyl-4-oxo-2-pyridin-2-yl-3H-thieno[2,3-d]pyrimidine-6-carboxamide cid_2458771
Type:
Small organic molecule
Emp. Form.:
C15H14N4O2S
Mol. Mass.:
314.362
SMILES:
CN(C)C(=O)c1sc2nc([nH]c(=O)c2c1C)-c1ccccn1
: