Target
Nucleotide-binding oligomerization domain-containing protein 1
Ligand
BDBM54520
Substrate
Meas. Tech.
uHTS luminescence assay for the identification of compounds that inhibit NOD1
EC50
5510±n/a nM
Citation
 PubChem, PC uHTS luminescence assay for the identification of compounds that inhibit NOD1 PubChem Bioassay (2010)[AID] 
Target
Name:
Nucleotide-binding oligomerization domain-containing protein 1
Synonyms:
CARD4 NOD1_HUMAN | nucleotide-binding oligomerization domain containing 1
Type:
Enzyme Catalytic Domain
Mol. Mass.:
107699.03
Organism:
Homo sapiens (Human)
Description:
gi_5174617
Residue:
953
  
Inhibitor
Name:
BDBM54520
Synonyms:
MLS001072146 N-[4-(2-ethylpiperidino)sulfonylphenyl]isonicotinamide SMR000671409 | cid_6470627
Type:
Small organic molecule
Emp. Form.:
C19H23N3O3S
Mol. Mass.:
373.469
SMILES:
CCC1CCCCN1S(=O)(=O)c1ccc(NC(=O)c2ccncc2)cc1
: