Target
G-protein coupled receptor 55
Ligand
BDBM61412
Substrate
Meas. Tech.
Image-Based HTS for Selective Antagonists for GPR55
IC50
672.4113±n/a nM
Citation
 PubChem, PC Image-Based HTS for Selective Antagonists for GPR55 PubChem Bioassay (2010)[AID] 
Target
Name:
G-protein coupled receptor 55
Synonyms:
G protein-coupled receptor 55 GPR55_HUMAN
Type:
PROTEIN
Mol. Mass.:
36649.72
Organism:
Homo sapiens (Human)
Description:
ChEMBL_1292265
Residue:
319
  
Inhibitor
Name:
BDBM61412
Synonyms:
MLS000085438 cid_3243007
Type:
Small organic molecule
Emp. Form.:
C18H19NO3S2
Mol. Mass.:
361.478
SMILES:
[H]C12CCC([H])(C1)C1C2Sc2[nH]c(=O)sc2C1c1ccc(O)c(OC)c1
: