Target
G-protein coupled receptor 55
Ligand
BDBM61413
Substrate
Meas. Tech.
Image-Based HTS for Selective Antagonists for GPR55
IC50
1059.649±n/a nM
Citation
 PubChem, PC Image-Based HTS for Selective Antagonists for GPR55 PubChem Bioassay (2010)[AID] 
Target
Name:
G-protein coupled receptor 55
Synonyms:
G protein-coupled receptor 55 GPR55_HUMAN
Type:
PROTEIN
Mol. Mass.:
36649.72
Organism:
Homo sapiens (Human)
Description:
ChEMBL_1292265
Residue:
319
  
Inhibitor
Name:
BDBM61413
Synonyms:
MLS000091137 N-ethyl-N-(2-ethylphenyl)-3-[3-(p-tolyl)-1,2,4-oxadiazol-5-yl]propionamide cid_3244778
Type:
Small organic molecule
Emp. Form.:
C22H25N3O2
Mol. Mass.:
363.4528
SMILES:
CCN(C(=O)CCc1nc(no1)-c1ccc(C)cc1)c1ccccc1CC
: