Target
G-protein coupled receptor 55
Ligand
BDBM61479
Substrate
Meas. Tech.
Image-Based HTS for Selective Antagonists for GPR55
IC50
552.4818±n/a nM
Citation
 PubChem, PC Image-Based HTS for Selective Antagonists for GPR55 PubChem Bioassay (2010)[AID] 
Target
Name:
G-protein coupled receptor 55
Synonyms:
G protein-coupled receptor 55 GPR55_HUMAN
Type:
PROTEIN
Mol. Mass.:
36649.72
Organism:
Homo sapiens (Human)
Description:
ChEMBL_1292265
Residue:
319
  
Inhibitor
Name:
BDBM61479
Synonyms:
4-butyl-4-(3-nitrobenzyl)-1,2-diphenyl-3,5-pyrazolidinedione 4-butyl-4-[(3-nitrophenyl)methyl]-1,2-diphenyl-pyrazolidine-3,5-dione MLS000575653 cid_1828692
Type:
Small organic molecule
Emp. Form.:
C26H25N3O4
Mol. Mass.:
443.4944
SMILES:
CCCCC1(Cc2cccc(c2)[N+]([O-])=O)C(=O)N(N(C1=O)c1ccccc1)c1ccccc1
: