Target
G-protein coupled receptor 55
Ligand
BDBM61488
Substrate
Meas. Tech.
Image-Based HTS for Selective Antagonists for GPR55
IC50
678.2253±n/a nM
Citation
 PubChem, PC Image-Based HTS for Selective Antagonists for GPR55 PubChem Bioassay (2010)[AID] 
Target
Name:
G-protein coupled receptor 55
Synonyms:
G protein-coupled receptor 55 GPR55_HUMAN
Type:
PROTEIN
Mol. Mass.:
36649.72
Organism:
Homo sapiens (Human)
Description:
ChEMBL_1292265
Residue:
319
  
Inhibitor
Name:
BDBM61488
Synonyms:
MLS000577269 N-[4-(tert-butylsulfamoyl)phenyl]-2-phenyl-2-phenylsulfanyl-ethanamide N-{4-[(tert-butylamino)sulfonyl]phenyl}-2-phenyl-2-(phenylthio)acetamide cid_2928544
Type:
Small organic molecule
Emp. Form.:
C24H26N2O3S2
Mol. Mass.:
454.605
SMILES:
CC(C)(C)NS(=O)(=O)c1ccc(NC(=O)C(Sc2ccccc2)c2ccccc2)cc1
: