Target
G-protein coupled receptor 55
Ligand
BDBM57502
Substrate
Meas. Tech.
Image-Based HTS for Selective Antagonists for GPR55
IC50
500±n/a nM
Citation
 PubChem, PC Image-Based HTS for Selective Antagonists for GPR55 PubChem Bioassay (2010)[AID] 
Target
Name:
G-protein coupled receptor 55
Synonyms:
G protein-coupled receptor 55 GPR55_HUMAN
Type:
PROTEIN
Mol. Mass.:
36649.72
Organism:
Homo sapiens (Human)
Description:
ChEMBL_1292265
Residue:
319
  
Inhibitor
Name:
BDBM57502
Synonyms:
(5Z)-2-azanylidene-3-(2-fluorophenyl)-5-[[5-(4-fluorophenyl)-1H-pyrazol-4-yl]methylidene]-1,3-thiazolidin-4-one (5Z)-3-(2-fluorophenyl)-5-[[5-(4-fluorophenyl)-1H-pyrazol-4-yl]methylidene]-2-imino-1,3-thiazolidin-4-one (5Z)-3-(2-fluorophenyl)-5-{[3-(4-fluorophenyl)-1H-pyrazol-4-yl]methylene}-2-imino-1,3-thiazolidin-4-one SMR000204487 | cid_5292877
Type:
Small organic molecule
Emp. Form.:
C19H12F2N4OS
Mol. Mass.:
382.387
SMILES:
Fc1ccc(cc1)-c1n[nH]cc1C=C1SC(=N)N(C1=O)c1ccccc1F
: