Target
G-protein coupled receptor 55
Ligand
BDBM32877
Substrate
Meas. Tech.
Image-Based HTS for Selective Antagonists for GPR55
IC50
978.3354±n/a nM
Citation
 PubChem, PC Image-Based HTS for Selective Antagonists for GPR55 PubChem Bioassay (2010)[AID] 
Target
Name:
G-protein coupled receptor 55
Synonyms:
G protein-coupled receptor 55 GPR55_HUMAN
Type:
PROTEIN
Mol. Mass.:
36649.72
Organism:
Homo sapiens (Human)
Description:
ChEMBL_1292265
Residue:
319
  
Inhibitor
Name:
BDBM32877
Synonyms:
(5E)-1-(2-chlorobenzyl)-5-[(1-methylpyrrol-2-yl)methylene]barbituric acid (5E)-1-[(2-chlorophenyl)methyl]-5-[(1-methylpyrrol-2-yl)methylidene]-1,3-diazinane-2,4,6-trione MLS000675880 cid_2186482
Type:
Small organic molecule
Emp. Form.:
C17H14ClN3O3
Mol. Mass.:
343.764
SMILES:
Cn1cccc1\C=C1/C(=O)NC(=O)N(Cc2ccccc2Cl)C1=O
: