Target
G-protein coupled receptor 55
Ligand
BDBM61535
Substrate
Meas. Tech.
Image-Based HTS for Selective Antagonists for GPR55
IC50
653.4675±n/a nM
Citation
 PubChem, PC Image-Based HTS for Selective Antagonists for GPR55 PubChem Bioassay (2010)[AID] 
Target
Name:
G-protein coupled receptor 55
Synonyms:
G protein-coupled receptor 55 GPR55_HUMAN
Type:
PROTEIN
Mol. Mass.:
36649.72
Organism:
Homo sapiens (Human)
Description:
ChEMBL_1292265
Residue:
319
  
Inhibitor
Name:
BDBM61535
Synonyms:
MLS000717682 [4-(2,7-dimethyl-5,6,7,8-tetrahydro-[1]benzothiolo[2,3-d]pyrimidin-4-yl)-1-piperazinyl]-(2-furanyl)methanone [4-(2,7-dimethyl-5,6,7,8-tetrahydrobenzothiopheno[2,3-d]pyrimidin-4-yl)piperazino]-(2-furyl)methanone | cid_3193014
Type:
Small organic molecule
Emp. Form.:
C21H24N4O2S
Mol. Mass.:
396.506
SMILES:
CC1CCc2c(C1)sc1nc(C)nc(N3CCN(CC3)C(=O)c3ccco3)c21
: