Target
G-protein coupled receptor 35
Ligand
BDBM50999
Substrate
Meas. Tech.
Image-Based HTS for Selective Antagonists of GPR35
IC50
1424.125±n/a nM
Citation
 PubChem, PC Image-Based HTS for Selective Antagonists of GPR35 PubChem Bioassay (2010)[AID] 
Target
Name:
G-protein coupled receptor 35
Synonyms:
G protein-coupled receptor 35 GPR35_HUMAN
Type:
Enzyme Catalytic Domain
Mol. Mass.:
34085.57
Organism:
Homo sapiens (Human)
Description:
gi_33695097
Residue:
309
  
Inhibitor
Name:
BDBM50999
Synonyms:
3-(1,3-benzodioxol-5-yl)-2-methylsulfonyl-5-phenyl-3,4-dihydropyrazole 5-Benzo[1,3]dioxol-5-yl-1-methanesulfonyl-3-phenyl-4,5-dihydro-1H-pyrazole SMR000172323 | cid_3153499
Type:
Small organic molecule
Emp. Form.:
C17H16N2O4S
Mol. Mass.:
344.385
SMILES:
CS(=O)(=O)N1N=C(CC1c1ccc2OCOc2c1)c1ccccc1
: