Target
Voltage-dependent N-type calcium channel subunit alpha-1B
Ligand
BDBM34648
Substrate
Meas. Tech.
Homogeneous Time-Resolved Fluorescence Resonance Energy Transfer (HTRF) Assay
IC50
10600±n/a nM
Citation
 PubChem, PC Homogeneous Time-Resolved Fluorescence Resonance Energy Transfer (HTRF) Assay PubChem Bioassay (2009)[AID] 
Target
Name:
Voltage-dependent N-type calcium channel subunit alpha-1B
Synonyms:
BIII CAC1B_HUMAN CACNA1B Calcium channel (Type N) Voltage-dependent N-type calcium channel subunit alpha-1B Voltage-gated N-type calcium channel alpha-1B subunit Voltage-gated calcium channel Voltage-gated calcium channel subunit alpha Cav2.2 ((alpha 1B, beta 1b, alpha 2 delta-1) | calcium channel, voltage-dependent, N type, alpha 1B subunit
Type:
Enzyme
Mol. Mass.:
262548.16
Organism:
Homo sapiens (Human)
Description:
Q00975
Residue:
2339
  
Inhibitor
Name:
BDBM34648
Synonyms:
(4-chlorodithiazol-5-ylidene)-(4,6-dimethyl-2-pyridyl)amine 4-chloro-N-(4,6-dimethyl-2-pyridinyl)-5-dithiazolimine MLS000104333 cid_757789
Type:
Small organic molecule
Emp. Form.:
C9H8ClN3S2
Mol. Mass.:
257.763
SMILES:
Cc1cc(C)nc(c1)N=c1ssnc1Cl
: