Target
Gag-Pol polyprotein [588-1027]/[588-1147]
Ligand
BDBM2348
Substrate
poly(rC)-oligo(dG)(12-18)
Meas. Tech.
HIV RT Assay
pH
7.8±n/a
Temperature
310.15±n/a K
IC50
4000±1200 nM
Citation
 Artico, MSilvestri, RMassa, SLoi, AGCorrias, SPiras, GLa Colla, P 2-Sulfonyl-4-chloroanilino moiety: a potent pharmacophore for the anti-human immunodeficiency virus type 1 activity of pyrrolyl aryl sulfones. J Med Chem 39:522-30 (1996)  
Target
Name:
Gag-Pol polyprotein [588-1027]/[588-1147]
Synonyms:
EC: 2.7.7.49 | HIV-1 Reverse Transcriptase
Type:
Protein Complex
Mol. Mass.:
115684
Description:
Components:
This complex has 2 components.
Component 1
Name:
Gag-Pol polyprotein [588-1147]
Synonyms:
HIV-1 Reverse Transcriptase Chain A gag-pol
Type:
Enzyme Subunit
Mol. Mass.:
64486.41
Organism:
Human immunodeficiency virus type 1
Description:
P04585[588-1147]
Residue:
560
  
Component 2
Name:
Gag-Pol polyprotein [588-1027]
Synonyms:
HIV-1 Reverse Transcriptase Chain B gag-pol
Type:
Enzyme Subunit
Mol. Mass.:
51337.13
Organism:
Human immunodeficiency virus type 1
Description:
P04585[588-1027]
Residue:
440
  
Inhibitor
Name:
BDBM2348
Synonyms:
Ethyl 1-[(2-Amino-5-methylphenyl)sulfonyl]-1H-pyrrole-2-carboxylate ethyl 1-[(2-amino-5-methylbenzene)sulfonyl]-1H-pyrrole-2-carboxylate
Type:
Small organic molecule
Emp. Form.:
C14H16N2O4S
Mol. Mass.:
308.353
SMILES:
CCOC(=O)c1cccn1S(=O)(=O)c1cc(C)ccc1N
:
Substrate
Name:
poly(rC)-oligo(dG)(12-18)
Synonyms:
Type:
RNA/DNA duplex
Mol. Mass.:
358.43
Organism:
Description:
The incorporation of Tritium-labeled dGTP onto a poly(rC)-oligo(dG)(12-18) template-primer
Residue:
3
NA