Target
Gag-Pol polyprotein [588-1127,Y768C]/[588-1147,Y768C]
Ligand
BDBM2340
Substrate
poly(rC)-oligo(dG)(12-18)
Meas. Tech.
HIV RT Assay
pH
7.8±n/a
Temperature
310.15±n/a K
IC50
5000±1500 nM
Citation
 Artico, MSilvestri, RMassa, SLoi, AGCorrias, SPiras, GLa Colla, P 2-Sulfonyl-4-chloroanilino moiety: a potent pharmacophore for the anti-human immunodeficiency virus type 1 activity of pyrrolyl aryl sulfones. J Med Chem 39:522-30 (1996)  
Target
Name:
Gag-Pol polyprotein [588-1127,Y768C]/[588-1147,Y768C]
Synonyms:
EC: 2.7.7.49 | HIV-1 Reverse Transcriptase Mutant (Y181C)
Type:
Protein Complex
Mol. Mass.:
Description:
Components:
This complex has 2 components.
Component 1
Name:
Gag-Pol polyprotein [588-1147,Y768C]
Synonyms:
HIV-1 Reverse Transcriptase Mutant (Y181C) Chain A gag-pol
Type:
Enzyme Subunit
Mol. Mass.:
64426.38
Organism:
Human immunodeficiency virus type 1
Description:
P04585[588-1147,Y768C]
Residue:
560
  
Component 2
Name:
Gag-Pol polyprotein [588-1127,Y768C]
Synonyms:
HIV-1 Reverse Transcriptase Mutant (Y181C) Chain B gag-pol
Type:
Enzyme Subunit
Mol. Mass.:
51277.10
Organism:
Human immunodeficiency virus type 1
Description:
P04585[588-1127,Y768C]
Residue:
440
  
Inhibitor
Name:
BDBM2340
Synonyms:
Pyrrolyl Aryl Sulfone (PAS) 8f propyl 1-[(2-amino-5-chlorobenzene)sulfonyl]-1H-pyrrole-2-carboxylate
Type:
Small organic molecule
Emp. Form.:
C14H15ClN2O4S
Mol. Mass.:
342.798
SMILES:
CCCOC(=O)c1cccn1S(=O)(=O)c1cc(Cl)ccc1N
:
Substrate
Name:
poly(rC)-oligo(dG)(12-18)
Synonyms:
Type:
RNA/DNA duplex
Mol. Mass.:
358.43
Organism:
Description:
The incorporation of Tritium-labeled dGTP onto a poly(rC)-oligo(dG)(12-18) template-primer
Residue:
3
NA