Target
Nucleotide-binding oligomerization domain-containing protein 1
Ligand
BDBM62277
Substrate
Meas. Tech.
SAR analysis of compounds that inhibit NOD1 revised
IC50
8230±n/a nM
Citation
 PubChem, PC SAR analysis of compounds that inhibit NOD1 revised PubChem Bioassay (2010)[AID] 
Target
Name:
Nucleotide-binding oligomerization domain-containing protein 1
Synonyms:
CARD4 NOD1_HUMAN | nucleotide-binding oligomerization domain containing 1
Type:
Enzyme Catalytic Domain
Mol. Mass.:
107699.03
Organism:
Homo sapiens (Human)
Description:
gi_5174617
Residue:
953
  
Inhibitor
Name:
BDBM62277
Synonyms:
1-[[(E)-(5-ethoxy-6-keto-cyclohexa-2,4-dien-1-ylidene)methyl]amino]-3-(2-nitrophenyl)thiourea 1-[[(E)-(5-ethoxy-6-oxo-1-cyclohexa-2,4-dienylidene)methyl]amino]-3-(2-nitrophenyl)thiourea MLS-0270696.0001 | cid_6297486
Type:
Small organic molecule
Emp. Form.:
C16H16N4O4S
Mol. Mass.:
360.388
SMILES:
CCOc1ccc[c-](C=[NH+]NC(=S)Nc2ccccc2[N+]([O-])=O)c1=O
: