Target
Nucleotide-binding oligomerization domain-containing protein 1
Ligand
BDBM59547
Substrate
Meas. Tech.
SAR analysis of compounds that inhibit NOD1 revised
IC50
3490±n/a nM
Citation
 PubChem, PC SAR analysis of compounds that inhibit NOD1 revised PubChem Bioassay (2010)[AID] 
Target
Name:
Nucleotide-binding oligomerization domain-containing protein 1
Synonyms:
CARD4 NOD1_HUMAN | nucleotide-binding oligomerization domain containing 1
Type:
Enzyme Catalytic Domain
Mol. Mass.:
107699.03
Organism:
Homo sapiens (Human)
Description:
gi_5174617
Residue:
953
  
Inhibitor
Name:
BDBM59547
Synonyms:
(4Z)-4-(3-bromo-4-hydroxy-5-methoxy-benzylidene)-1-(3-chlorophenyl)pyrazolidine-3,5-quinone (4Z)-4-[(3-bromo-4-hydroxy-5-methoxyphenyl)methylidene]-1-(3-chlorophenyl)pyrazolidine-3,5-dione MLS001210835 cid_1108981
Type:
Small organic molecule
Emp. Form.:
C17H12BrClN2O4
Mol. Mass.:
423.645
SMILES:
COc1cc(\C=C2\C(=O)NN(C2=O)c2cccc(Cl)c2)cc(Br)c1O
: